【Vue】问题:Error: Command failed: C:\windows\system32\cmd.exe /s /c “autoreconf -ivf“

本文记录了一次使用npm安装过程中遇到的错误及解决步骤。错误涉及gifsicle模块编译失败和依赖项获取问题。通过删除node_modules文件夹并重新运行cnpminstall命令解决了该问题。

摘要生成于 C知道 ,由 DeepSeek-R1 满血版支持, 前往体验 >

问题内容

npm ERR! code 1
npm ERR! path E:\WebProject\jeecgboot-vue3\node_modules\gifsicle
npm ERR! command failed
npm ERR! command C:\windows\system32\cmd.exe /d /s /c C:\Users\ADMINI~1\AppData\Local\Temp\postinstall-5d2ef6ec.cmd
npm ERR! ‼ getaddrinfo ENOENT raw.githubusercontent.com
npm ERR!   ‼ gifsicle pre-build test failed
npm ERR!   i compiling from source
npm ERR!   × Error: Command failed: C:\windows\system32\cmd.exe /s /c "autoreconf -ivf"
npm ERR! 'autoreconf' �����ڲ����ⲿ���Ҳ���ǿ����еij���
npm ERR! �����������
npm ERR!
npm ERR!
npm ERR!     at E:\WebProject\jeecgboot-vue3\node_modules\bin-build\node_modules\execa\index.js:231:11
npm ERR!     at runMicrotasks (<anonymous>)
npm ERR!     at processTicksAndRejections (node:internal/process/task_queues:96:5)
npm ERR!     at async Promise.all (index 0)

npm ERR! A complete log of this run can be found in:
npm ERR!     C:\Program Files\nodejs\node_global\_logs\2022-11-17T05_36_43_229Z-debug-0.log

问题解决

1、移除文件夹node_modules
2、使用 cnpm install

评论 1
添加红包

请填写红包祝福语或标题

红包个数最小为10个

红包金额最低5元

当前余额3.43前往充值 >
需支付:10.00
成就一亿技术人!
领取后你会自动成为博主和红包主的粉丝 规则
hope_wisdom
发出的红包

打赏作者

小沈曰

你的鼓励将是我创作的最大动力

¥1 ¥2 ¥4 ¥6 ¥10 ¥20
扫码支付:¥1
获取中
扫码支付

您的余额不足,请更换扫码支付或充值

打赏作者

实付
使用余额支付
点击重新获取
扫码支付
钱包余额 0

抵扣说明:

1.余额是钱包充值的虚拟货币,按照1:1的比例进行支付金额的抵扣。
2.余额无法直接购买下载,可以购买VIP、付费专栏及课程。

余额充值